{"text_format":"1","workbook":"xlsx","n_sheets":5,"sheets":["Orders","常用產品","常用客戶主檔","訂單編碼","開立紀錄"],"not_rendered":{"charts":0,"images":0,"macros":1,"external_links":0,"defined_names":3,"comments":0,"pivot_tables":0},"unopened":[],"bounds":{"document_bytes":16777216,"sheet_cells":100000,"rows_first":2000,"rows_last":500,"rows_between":2000,"halvings":0,"cell_chars":16384,"cell_head_chars":4096},"cells_cut":0,"cells_raw":0,"read":"whole","date_system":"1900"}

{"sheet":"Orders","index":0,"n_rows":1000,"n_cols":35,"rows_kept":1000,"cut":false,"hidden":false,"merged":[]}
["InvoiceProcessStatus","InvoiceID","UTCInvoiceDateTime","ProductID","ProductName","Quantity","UnitPrice","BuyerEmailAddress","BuyerName","BuyerInvoiceTitle","BuyerID","BuyerTelNo","SalesAmount","TaxType","TaxAmount","TotalAmount","MainRemark","CarrierType","NPOBAN","InvoiceFor","BuyerAddress","DetailID","SubTotal","SalesID","DeptID","CarrierId","RandomNumber","RelateNumber","Remark","CustomsClearanceMark","BondedArea","BillingNo","InvoiceDateTime","ItemTaxDiff","CheckNumber"]
["開立狀態","可輸入當期發票號碼","發票日期\\號碼\n系統產生","建議 20字內(選填)","原銷售產品品名","(銷售或折讓數量)","預設C類含稅，B類未稅。(銷售或折讓單價)","(選填)通知客戶用","C類選填","B類必填","B類必填/無統編法人可填00000000","選填","B類銷售額為單身小計總合(未稅)，C為含稅。","1:應稅 2:零稅率 3:免稅","銷售額*0.05。C類為0。計算稅額在±2元以上會自動調整並記錄","銷售總額+總稅額之和","備註 50字內(選填)作廢發票可填寫作廢說明","1.手機條碼(選填)","C類捐贈時使用(選填)","B(稅外加)\nC類(稅內含)","選填","若無\n系統可補","小計=數量*單價(銷售或折讓額)","業務姓名(選填)","空白預設公司(選填)","電子發票載具使用(選填)","4碼 for B2C，若無系統可補(選填)","可作為紀錄訂單、採購單編號之用(選填)","單身明細備註(選填)","1：非經海關出口\n2：經海關出口\n(若為零稅率發票，此\n為必填欄位)"," 1:買受人為保稅區營業人 2:買受人為遠洋漁業營業人3:買受人為自由貿易港區營業人;","訂單OR帳單號選填","發票時間\n\n無則系統預設","產品單價如非預設時請註記為Y。預設(未設定)為N","4碼 for B類發票，若無系統可補(選填)"]
["發票作業","發票字軌號碼","發票日期","產品代號","產品名稱","購買數量","產品單價","客戶電子郵件","買受人名稱","買受人發票抬頭","買受人統編","客戶行動電話","訂單總額","課稅類別","應稅稅額","發票總額","信用卡號/備註","歸戶條碼","捐贈愛心碼","發票類型","客戶郵寄地址","單身項次","產品小計","業務姓名","部門","載具類型","隨機碼","關聯號碼","單身備註","海關註記","零稅率註記","訂單號","發票開立時間","差異註記","檢查碼"]
["I","QE12345000","2017-09-30","AU1709280706","A5紙","1",1,"nomail@nomail.com","會員NO07055","","","",1,1,0,1,"","","","C",null,null,1,null,null,null,null,null,null,null,null,""]
[]
[]
[]
[]
[]
[]
[]
[]
[]
[]
[]
[]
[]
[]
[]
[]
[]
[]
[]
[]
[]
[]
[]
[]
[]
[]
[]
[]
[]
[]
[]
[]
[]
[]
[]
[]
[]
[]
[]
[]
[]
[]
[]
[]
[]
[]
[]
[]
[]
[]
[]
[]
[]
[]
[]
[]
[]
[]
[]
[]
[]
[]
[]
[]
[]
[]
[]
[]
[]
[]
[]
[]
[]
[]
[]
[]
[]
[]
[]
[]
[]
[]
[]
[]
[]
[]
[]
[]
[]
[]
[]
[]
[]
[]
[]
[]
[]
[]
[]
[]
[]
[]
[]
[]
[]
[]
[]
[]
[]
[]
[]
[]
[]
[]
[]
[]
[]
[]
[]
[]
[]
[]
[]
[]
[]
[]
[]
[]
[]
[]
[]
[]
[]
[]
[]
[]
[]
[]
[]
[]
[]
[]
[]
[]
[]
[]
[]
[]
[]
[]
[]
[]
[]
[]
[]
[]
[]
[]
[]
[]
[]
[]
[]
[]
[]
[]
[]
[]
[]
[]
[]
[]
[]
[]
[]
[]
[]
[]
[]
[]
[]
[]
[]
[]
[]
[]
[]
[]
[]
[]
[]
[]
[]
[]
[]
[]
[]
[]
[]
[]
[]
[]
[]
[]
[]
[]
[]
[]
[]
[]
[]
[]
[]
[]
[]
[]
[]
[]
[]
[]
[]
[]
[]
[]
[]
[]
[]
[]
[]
[]
[]
[]
[]
[]
[]
[]
[]
[]
[]
[]
[]
[]
[]
[]
[]
[]
[]
[]
[]
[]
[]
[]
[]
[]
[]
[]
[]
[]
[]
[]
[]
[]
[]
[]
[]
[]
[]
[]
[]
[]
[]
[]
[]
[]
[]
[]
[]
[]
[]
[]
[]
[]
[]
[]
[]
[]
[]
[]
[]
[]
[]
[]
[]
[]
[]
[]
[]
[]
[]
[]
[]
[]
[]
[]
[]
[]
[]
[]
[]
[]
[]
[]
[]
[]
[]
[]
[]
[]
[]
[]
[]
[]
[]
[]
[]
[]
[]
[]
[]
[]
[]
[]
[]
[]
[]
[]
[]
[]
[]
[]
[]
[]
[]
[]
[]
[]
[]
[]
[]
[]
[]
[]
[]
[]
[]
[]
[]
[]
[]
[]
[]
[]
[]
[]
[]
[]
[]
[]
[]
[]
[]
[]
[]
[]
[]
[]
[]
[]
[]
[]
[]
[]
[]
[]
[]
[]
[]
[]
[]
[]
[]
[]
[]
[]
[]
[]
{"$rows_left_out":601}
{"sheet":"常用產品","index":1,"n_rows":12,"n_cols":4,"rows_kept":12,"cut":false,"hidden":false,"merged":[[0,0,0,3]]}
["可以先將常用品號品名先在此建檔選用\n(注意:建檔完畢請重整資料)"]
["產品代號 20碼","產品名稱 (不可重複)","單價未稅","備註"]
["AU1709280709","A4紙",0.5]
["AU1709280706","A5紙",1]
["AU1709280761","女裝",2000]
["AU1709280302","吸塵器",14500]
["AU1709280014","男裝",1250]
["AU1709280580","原子筆",25]
["AU1709280290","筆記本",200]
["AU1709280814","遊艇",5000000]
["AU1709280533","鉛筆",5]
["AU1709280775","電視",21000]

{"sheet":"常用客戶主檔","index":2,"n_rows":1999,"n_cols":15,"rows_kept":1999,"cut":false,"hidden":false,"merged":[[0,0,0,8]]}
["你可將常用客戶先建檔 待選用(支援2000筆資料)",null,null,null,null,null,null,null,null,null,null,null,null,null,"B"]
["客戶電子郵件/代號","買受人名稱","買受人發票抬頭","買受人統編","客戶行動電話","歸戶碼","愛心碼","發票類型","客戶電子郵件/代號",null,null,null,null,null,"C"]
["nomail@nomail.no1","王老五",null,"","",null,null,"C","熱感紙-二聯"]
["nomail@nomail.no1","李四海","四海企業社","88889999","098888899",null,null,"B","A4-三聯"]
["nomail@nomail.no1","陳三娘","國家機關單位","00000000","07-2223333",null,null,"C","A4-二聯"]
["nomail@no.mail","湯姆王","航海王公司","78945612","0911110213",null,null,"B","A4-三聯"]
[]
[]
[]
[]
[]
[]
[]
[]
[]
[]
[]
[]
[]
[]
[]
[null,null,null,"",""]
[null,null,null,"",""]
[null,null,null,"",""]
[null,null,null,"",""]
[null,null,null,"",""]
[null,null,null,"",""]
[null,null,null,"",""]
[null,null,null,"",""]
[null,null,null,"",""]
[null,null,null,"",""]
[null,null,null,"",""]
[null,null,null,"",""]
[null,null,null,"",""]
[null,null,null,"",""]
[null,null,null,"",""]
[null,null,null,"",""]
[null,null,null,"",""]
[null,null,null,"",""]
[null,null,null,"",""]
[null,null,null,"",""]
[null,null,null,"",""]
[null,null,null,"",""]
[null,null,null,"",""]
[null,null,null,"",""]
[null,null,null,"",""]
[null,null,null,"",""]
[null,null,null,"",""]
[null,null,null,"",""]
[null,null,null,"",""]
[null,null,null,"",""]
[null,null,null,"",""]
[null,null,null,"",""]
[null,null,null,"",""]
[null,null,null,"",""]
[null,null,null,"",""]
[null,null,null,"",""]
[null,null,null,"",""]
[null,null,null,"",""]
[null,null,null,"",""]
[null,null,null,"",""]
[null,null,null,"",""]
[null,null,null,"",""]
[null,null,null,"",""]
[null,null,null,"",""]
[null,null,null,"",""]
[null,null,null,"",""]
[null,null,null,"",""]
[null,null,null,"",""]
[null,null,null,"",""]
[null,null,null,"",""]
[null,null,null,"",""]
[null,null,null,"",""]
[null,null,null,"",""]
[null,null,null,"",""]
[null,null,null,"",""]
[null,null,null,"",""]
[null,null,null,"",""]
[null,null,null,"",""]
[null,null,null,"",""]
[null,null,null,"",""]
[null,null,null,"",""]
[null,null,null,"",""]
[null,null,null,"",""]
[null,null,null,"",""]
[null,null,null,"",""]
[null,null,null,"",""]
[null,null,null,"",""]
[null,null,null,"",""]
[null,null,null,"",""]
[null,null,null,"",""]
[null,null,null,"",""]
[null,null,null,"",""]
[null,null,null,"",""]
[null,null,null,"",""]
[null,null,null,"",""]
[null,null,null,"",""]
[null,null,null,"",""]
[null,null,null,"",""]
[null,null,null,"",""]
[null,null,null,"",""]
[null,null,null,"",""]
[null,null,null,"",""]
[null,null,null,"",""]
[null,null,null,"",""]
[null,null,null,"",""]
[null,null,null,"",""]
[null,null,null,"",""]
[null,null,null,"",""]
[null,null,null,"",""]
[null,null,null,"",""]
[null,null,null,"",""]
[null,null,null,"",""]
[null,null,null,"",""]
[null,null,null,"",""]
[null,null,null,"",""]
[null,null,null,"",""]
[null,null,null,"",""]
[null,null,null,"",""]
[null,null,null,"",""]
[null,null,null,"",""]
[null,null,null,"",""]
[null,null,null,"",""]
[null,null,null,"",""]
[null,null,null,"",""]
[null,null,null,"",""]
[null,null,null,"",""]
[null,null,null,"",""]
[null,null,null,"",""]
[null,null,null,"",""]
[null,null,null,"",""]
[null,null,null,"",""]
[null,null,null,"",""]
[null,null,null,"",""]
[null,null,null,"",""]
[null,null,null,"",""]
[null,null,null,"",""]
[null,null,null,"",""]
[null,null,null,"",""]
[null,null,null,"",""]
[null,null,null,"",""]
[null,null,null,"",""]
[null,null,null,"",""]
[null,null,null,"",""]
[null,null,null,"",""]
[null,null,null,"",""]
[null,null,null,"",""]
[null,null,null,"",""]
[null,null,null,"",""]
[null,null,null,"",""]
[null,null,null,"",""]
[null,null,null,"",""]
[null,null,null,"",""]
[null,null,null,"",""]
[null,null,null,"",""]
[null,null,null,"",""]
[null,null,null,"",""]
[null,null,null,"",""]
[null,null,null,"",""]
[null,null,null,"",""]
[null,null,null,"",""]
[null,null,null,"",""]
[null,null,null,"",""]
[null,null,null,"",""]
[null,null,null,"",""]
[null,null,null,"",""]
[null,null,null,"",""]
[null,null,null,"",""]
[null,null,null,"",""]
[null,null,null,"",""]
[null,null,null,"",""]
[null,null,null,"",""]
[null,null,null,"",""]
[null,null,null,"",""]
[null,null,null,"",""]
[null,null,null,"",""]
[null,null,null,"",""]
[null,null,null,"",""]
[null,null,null,"",""]
[null,null,null,"",""]
[null,null,null,"",""]
[null,null,null,"",""]
[null,null,null,"",""]
[null,null,null,"",""]
[null,null,null,"",""]
[null,null,null,"",""]
[null,null,null,"",""]
[null,null,null,"",""]
[null,null,null,"",""]
[null,null,null,"",""]
[null,null,null,"",""]
[null,null,null,"",""]
[null,null,null,"",""]
[null,null,null,"",""]
[null,null,null,"",""]
[null,null,null,"",""]
[null,null,null,"",""]
[null,null,null,"",""]
[null,null,null,"",""]
[null,null,null,"",""]
[null,null,null,"",""]
[null,null,null,"",""]
[null,null,null,"",""]
[null,null,null,"",""]
[null,null,null,"",""]
[null,null,null,"",""]
[null,null,null,"",""]
[null,null,null,"",""]
[null,null,null,"",""]
[null,null,null,"",""]
[null,null,null,"",""]
[null,null,null,"",""]
[null,null,null,"",""]
[null,null,null,"",""]
[null,null,null,"",""]
[null,null,null,"",""]
[null,null,null,"",""]
[null,null,null,"",""]
[null,null,null,"",""]
[null,null,null,"",""]
[null,null,null,"",""]
[null,null,null,"",""]
[null,null,null,"",""]
[null,null,null,"",""]
[null,null,null,"",""]
[null,null,null,"",""]
[null,null,null,"",""]
[null,null,null,"",""]
[null,null,null,"",""]
[null,null,null,"",""]
[null,null,null,"",""]
[null,null,null,"",""]
[null,null,null,"",""]
[null,null,null,"",""]
[null,null,null,"",""]
[null,null,null,"",""]
[null,null,null,"",""]
[null,null,null,"",""]
[null,null,null,"",""]
[null,null,null,"",""]
[null,null,null,"",""]
[null,null,null,"",""]
[null,null,null,"",""]
[null,null,null,"",""]
[null,null,null,"",""]
[null,null,null,"",""]
[null,null,null,"",""]
[null,null,null,"",""]
[null,null,null,"",""]
[null,null,null,"",""]
[null,null,null,"",""]
[null,null,null,"",""]
[null,null,null,"",""]
[null,null,null,"",""]
[null,null,null,"",""]
[null,null,null,"",""]
[null,null,null,"",""]
[null,null,null,"",""]
[null,null,null,"",""]
[null,null,null,"",""]
[null,null,null,"",""]
[null,null,null,"",""]
[null,null,null,"",""]
[null,null,null,"",""]
[null,null,null,"",""]
[null,null,null,"",""]
[null,null,null,"",""]
[null,null,null,"",""]
[null,null,null,"",""]
[null,null,null,"",""]
[null,null,null,"",""]
[null,null,null,"",""]
[null,null,null,"",""]
[null,null,null,"",""]
[null,null,null,"",""]
[null,null,null,"",""]
[null,null,null,"",""]
[null,null,null,"",""]
[null,null,null,"",""]
[null,null,null,"",""]
[null,null,null,"",""]
[null,null,null,"",""]
[null,null,null,"",""]
[null,null,null,"",""]
[null,null,null,"",""]
[null,null,null,"",""]
[null,null,null,"",""]
[null,null,null,"",""]
[null,null,null,"",""]
[null,null,null,"",""]
[null,null,null,"",""]
[null,null,null,"",""]
[null,null,null,"",""]
[null,null,null,"",""]
[null,null,null,"",""]
[null,null,null,"",""]
[null,null,null,"",""]
[null,null,null,"",""]
[null,null,null,"",""]
[null,null,null,"",""]
[null,null,null,"",""]
[null,null,null,"",""]
[null,null,null,"",""]
[null,null,null,"",""]
[null,null,null,"",""]
[null,null,null,"",""]
[null,null,null,"",""]
[null,null,null,"",""]
[null,null,null,"",""]
[null,null,null,"",""]
[null,null,null,"",""]
[null,null,null,"",""]
[null,null,null,"",""]
[null,null,null,"",""]
[null,null,null,"",""]
[null,null,null,"",""]
[null,null,null,"",""]
[null,null,null,"",""]
[null,null,null,"",""]
[null,null,null,"",""]
[null,null,null,"",""]
[null,null,null,"",""]
[null,null,null,"",""]
[null,null,null,"",""]
[null,null,null,"",""]
[null,null,null,"",""]
[null,null,null,"",""]
[null,null,null,"",""]
[null,null,null,"",""]
[null,null,null,"",""]
[null,null,null,"",""]
[null,null,null,"",""]
[null,null,null,"",""]
[null,null,null,"",""]
[null,null,null,"",""]
[null,null,null,"",""]
[null,null,null,"",""]
[null,null,null,"",""]
[null,null,null,"",""]
[null,null,null,"",""]
[null,null,null,"",""]
[null,null,null,"",""]
[null,null,null,"",""]
[null,null,null,"",""]
[null,null,null,"",""]
[null,null,null,"",""]
[null,null,null,"",""]
[null,null,null,"",""]
[null,null,null,"",""]
[null,null,null,"",""]
[null,null,null,"",""]
[null,null,null,"",""]
[null,null,null,"",""]
[null,null,null,"",""]
[null,null,null,"",""]
[null,null,null,"",""]
[null,null,null,"",""]
[null,null,null,"",""]
[null,null,null,"",""]
[null,null,null,"",""]
[null,null,null,"",""]
[null,null,null,"",""]
[null,null,null,"",""]
[null,null,null,"",""]
[null,null,null,"",""]
[null,null,null,"",""]
[null,null,null,"",""]
[null,null,null,"",""]
[null,null,null,"",""]
[null,null,null,"",""]
[null,null,null,"",""]
[null,null,null,"",""]
[null,null,null,"",""]
[null,null,null,"",""]
[null,null,null,"",""]
[null,null,null,"",""]
[null,null,null,"",""]
[null,null,null,"",""]
[null,null,null,"",""]
[null,null,null,"",""]
[null,null,null,"",""]
[null,null,null,"",""]
[null,null,null,"",""]
[null,null,null,"",""]
[null,null,null,"",""]
[null,null,null,"",""]
[null,null,null,"",""]
[null,null,null,"",""]
[null,null,null,"",""]
[null,null,null,"",""]
[null,null,null,"",""]
[null,null,null,"",""]
[null,null,null,"",""]
[null,null,null,"",""]
[null,null,null,"",""]
[null,null,null,"",""]
[null,null,null,"",""]
[null,null,null,"",""]
[null,null,null,"",""]
[null,null,null,"",""]
{"$rows_left_out":1600}
{"sheet":"訂單編碼","index":3,"n_rows":28,"n_cols":25,"rows_kept":28,"cut":false,"hidden":false,"merged":[[4,0,4,1],[4,2,4,4],[6,0,9,6]]}
[null,null,null,null,null,null,null,null,null,null,null,null,null,null,null,null,null,null,null,null,null,null,null,null,"B"]
["字軌","起號","迄號","最後開立日期","總張數","開立序","目前取號","期別",null,null,null,null,null,null,null,null,null,null,null,null,null,null,null,null,"C"]
[{"$f":"VLOOKUP(\"V\",$A$15:$E$20,3,FALSE)","v":"QE"},{"$f":"VLOOKUP(\"V\",$A$15:$E$20,4,FALSE)","v":22345000},{"$f":"VLOOKUP(\"V\",$A$15:$E$20,5,FALSE)","v":22348000},{"$f":"NOW()-6","v":"2017-09-26T14:44:06.130"},{"$f":"C3-B3","v":3000},0,{"$f":"A3&TEXT(B3+F3,\"00000000\")","v":"QE22345000"},{"$f":"VLOOKUP(\"V\",$A$15:$E$20,2,FALSE)","v":"09-10月"},"1民國yyymm",{"$f":"TEXT(YEAR(NOW())-1911,\"000\")&TEXT(MONTH(NOW()),\"00\")","v":"10610"},1,"A","2碼",{"$f":"TEXT($F$3,\"00\")","v":"00"}]
[]
["預設自收mail",null,"nomail@no.mail",null,null,null,null,null,"3簡年yy",{"$f":"TEXT(YEAR(NOW())-2000,\"00\")","v":"17"},3,"C","4碼",{"$f":"TEXT($F$3,\"0000\")","v":"0000"},null,null,null,null,null,null,null,null,null,null,"單價未稅"]
[]
["你可以設定你公司的訂單編碼供新訂單時取號用。\n編碼限制總長度為12碼以內。你可以自訂自己公司的編碼原則。\n淺藍色欄位可以下拉選擇，編碼結果是目前可以用的號碼",null,null,null,null,null,null,null,"4簡年月yymm",{"$f":"TEXT(YEAR(NOW())-2000,\"00\")&TEXT(MONTH(NOW()),\"00\")","v":"1710"},4,"D"]
[null,null,null,null,null,null,null,null,"5年月yyyymm",{"$f":"TEXT(YEAR(NOW()),\"0000\")&TEXT(MONTH(NOW()),\"00\")","v":"201710"},null,"E"]
[null,null,null,null,null,null,null,null,"6完整yyyymmdd",{"$f":"TEXT(YEAR(NOW()),\"0000\")&TEXT(MONTH(NOW()),\"00\")&TEXT(DAY(NOW()),\"00\")","v":"20171002"},null,"F"]
[null,null,null,null,null,null,null,null,null,null,null,"G"]
["請先設定各期保留手工開立電子發票號碼。並選擇當期期數",null,null,null,null,null,null,null,null,null,null,"H"]
[null,null,null,null,null,null,null,null,null,null,null,"I"]
[null,null,null,null,null,null,null,null,null,null,null,"J"]
["啟用","期別","字軌","切號起","切號止","張數","最後取號","開立張數",null,null,null,"K"]
[{"$f":"IF(MONTH($D$3) < 2,\"V\",\"\")","v":""},"01-02月","AQ",25510000,25512000,{"$f":"E15-D15","v":2000},{"$f":"IF(ISNA(VLOOKUP(C15,開立紀錄!$A$31:$D$9029,3,FALSE)),D15,VLOOKUP(C15,開立紀錄!$A$31:$D$9029,3,FALSE))","v":25510000},{"$f":"COUNTIF(開立紀錄!$A$31:D9029,C15)","v":0},null,null,null,"L"]
[{"$f":"IF(MONTH($D$3) =3,\"V\",IF(MONTH($D$3)=4,\"V\",\"\"))","v":""},"03-04月","BE",25510000,25512000,{"$f":"E16-D16","v":2000},{"$f":"IF(ISNA(VLOOKUP(C16,開立紀錄!$A$31:$D$9029,3,FALSE)),D16,VLOOKUP(C16,開立紀錄!$A$31:$D$9029,3,FALSE))","v":25510000},{"$f":"COUNTIF(開立紀錄!$A$31:D9030,C16)","v":0},null,null,null,"M"]
[{"$f":"IF(MONTH($D$3) =5,\"V\",IF(MONTH($D$3)=6,\"V\",\"\"))","v":""},"05-06月","QA",25510000,25512000,2000,{"$f":"IF(ISNA(VLOOKUP(C17,開立紀錄!$A$31:$D$9029,3,FALSE)),D17,VLOOKUP(C17,開立紀錄!$A$31:$D$9029,3,FALSE))","v":25510000},{"$f":"COUNTIF(開立紀錄!$A$31:D9031,C17)","v":0},null,null,null,"N"]
[{"$f":"IF(MONTH($D$3) =7,\"V\",IF(MONTH($D$3)=8,\"V\",\"\"))","v":""},"07-08月","CD",25510000,25512000,2000,{"$f":"IF(ISNA(VLOOKUP(C18,開立紀錄!$A$31:$D$9029,3,FALSE)),D18,VLOOKUP(C18,開立紀錄!$A$31:$D$9029,3,FALSE))","v":25510000},{"$f":"COUNTIF(開立紀錄!$A$31:D9032,C18)","v":0},null,null,null,"O"]
[{"$f":"IF(MONTH($D$3) =9,\"V\",IF(MONTH($D$3)=10,\"V\",\"\"))","v":"V"},"09-10月","QE",22345000,22348000,3000,{"$f":"IF(ISNA(VLOOKUP(C19,開立紀錄!$A$31:$D$9029,3,FALSE)),D19,VLOOKUP(C19,開立紀錄!$A$31:$D$9029,3,FALSE))","v":22345000},{"$f":"COUNTIF(開立紀錄!$A$31:D9033,C19)","v":0},null,null,null,"P"]
[{"$f":"IF(MONTH($D$3) =3,\"V\",IF(MONTH($D$3)=4,\"V\",\"\"))","v":""},"11-12月","NA",25510000,25512000,2000,{"$f":"IF(ISNA(VLOOKUP(C20,開立紀錄!$A$31:$D$9029,3,FALSE)),D20,VLOOKUP(C20,開立紀錄!$A$31:$D$9029,3,FALSE))","v":25510000},{"$f":"COUNTIF(開立紀錄!$A$31:D9034,C20)","v":0},null,null,null,"Q"]
[null,null,null,null,null,null,null,null,null,null,null,"S"]
[null,null,null,null,null,null,null,null,null,null,null,"T"]
[null,null,null,null,null,null,null,null,null,null,null,"U"]
[null,null,null,null,null,null,null,null,null,null,null,"V"]
[null,null,null,null,null,null,null,null,null,null,null,"W"]
[null,null,null,null,null,null,null,null,null,null,null,"X"]
[null,null,null,null,null,null,null,null,null,null,null,"Y"]
[null,null,null,null,null,null,null,null,null,null,null,"Z"]

{"sheet":"開立紀錄","index":4,"n_rows":120,"n_cols":5,"rows_kept":120,"cut":false,"hidden":false,"merged":[[0,4,0,7]]}
["期別字軌","發票日期","發票號","新增系統日","請勿刪除"]
[]
[]
[]
[]
[]
[]
[]
[]
[]
[]
[]
[]
[]
[]
[]
[]
[]
[]
[]
[]
[]
[]
[]
[]
[]
[]
[]
[]
[]
[]
[]
[]
[]
[]
[]
[]
[]
[]
[]
[]
[]
[]
[]
[]
[]
[]
[]
[]
[]
[]
[]
[]
[]
[]
[]
[]
[]
[]
[]
[]
[]
[]
[]
[]
[]
[]
[]
[]
[]
[]
[]
[]
[]
[]
[]
[]
[]
[]
[]
[]
[]
[]
[]
[]
[]
[]
[]
[]
[]
[]
[]
[]
[]
[]
[]
[]
[]
[]
[]
[]
[]
[]
[]
[]
[]
[]
[]
[]
[]
[]
[]
[]
[]
[]
[]
[]
[]
[]
[null,null,null,null,"a"]